{"text_format":"3","workbook":"xlsx","n_sheets":3,"sheets":["Ausdruck 2xA5","Ausdruck 4xA6","Inhaltsverzeichnis"],"not_rendered":{"defined_names":3},"read":"whole","date_system":"1900"}

{"sheet":"Ausdruck 2xA5","index":0,"n_rows":24,"n_cols":10,"rows_kept":24,"merged":[[0,1,0,2],[0,4,23,4],[0,5,23,5],[0,7,0,8]]}
["Lieder für:",{"$f":"TODAY()+7-WEEKDAY(TODAY(),2)","v":"2015-11-15"},{"$nulls":4},{"$f":"IF(A1=\"\",\"\",A1)","v":"Lieder für:"},"2015-11-15",{"$f":"C1","v":"00:00:00"},{"$f":"IF(D1=\"\",\"\",D1)","v":""}]
[null,"Nr.","Str.",{"$nulls":3},"","Nr.","Str.",""]
["Eingang:",null,{"$f":"IF(B3=\"\",\"_\",VLOOKUP(B3,Inhaltsverzeichnis!$A$2:$C$1016,3,1))","v":"_"},{"$f":"IF(B3=\"\",\"_\",VLOOKUP(B3,Inhaltsverzeichnis!$A$2:$C$1016,2,1))","v":"_"},null,null,"Eingang:","","_","_"]
[null,null,{"$f":"IF(B4=\"\",\"_\",VLOOKUP(B4,Inhaltsverzeichnis!$A$2:$C$1016,3,1))","v":"_"},{"$f":"IF(B4=\"\",\"_\",VLOOKUP(B4,Inhaltsverzeichnis!$A$2:$C$1016,2,1))","v":"_"},null,null,"","","_","_"]
["Kyrie:",null,{"$f":"IF(B5=\"\",\"_\",VLOOKUP(B5,Inhaltsverzeichnis!$A$2:$C$1016,3,1))","v":"_"},{"$f":"IF(B5=\"\",\"_\",VLOOKUP(B5,Inhaltsverzeichnis!$A$2:$C$1016,2,1))","v":"_"},null,null,"Kyrie:","","_","_"]
["Gloria:",null,{"$f":"IF(B6=\"\",\"_\",VLOOKUP(B6,Inhaltsverzeichnis!$A$2:$C$1016,3,1))","v":"_"},{"$f":"IF(B6=\"\",\"_\",VLOOKUP(B6,Inhaltsverzeichnis!$A$2:$C$1016,2,1))","v":"_"},null,null,"Gloria:","","_","_"]
["Tagesgebet:",null,{"$f":"IF(B7=\"\",\"_\",VLOOKUP(B7,Inhaltsverzeichnis!$A$2:$C$1016,3,1))","v":"_"},{"$f":"IF(B7=\"\",\"_\",VLOOKUP(B7,Inhaltsverzeichnis!$A$2:$C$1016,2,1))","v":"_"},null,null,"Tagesgebet:","","_","_"]
["Lesung 1:",null,{"$f":"IF(B8=\"\",\"_\",VLOOKUP(B8,Inhaltsverzeichnis!$A$2:$C$1016,3,1))","v":"_"},{"$f":"IF(B8=\"\",\"_\",VLOOKUP(B8,Inhaltsverzeichnis!$A$2:$C$1016,2,1))","v":"_"},null,null,"Lesung 1:","","_","_"]
["Zwischeng.:",null,{"$f":"IF(B9=\"\",\"_\",VLOOKUP(B9,Inhaltsverzeichnis!$A$2:$C$1016,3,1))","v":"_"},{"$f":"IF(B9=\"\",\"_\",VLOOKUP(B9,Inhaltsverzeichnis!$A$2:$C$1016,2,1))","v":"_"},null,null,"Zwischeng.:","","_","_"]
["Lesung 2:",null,{"$f":"IF(B10=\"\",\"_\",VLOOKUP(B10,Inhaltsverzeichnis!$A$2:$C$1016,3,1))","v":"_"},{"$f":"IF(B10=\"\",\"_\",VLOOKUP(B10,Inhaltsverzeichnis!$A$2:$C$1016,2,1))","v":"_"},null,null,"Lesung 2:","","_","_"]
["Ruf v.d. Ev.:",null,{"$f":"IF(B11=\"\",\"_\",VLOOKUP(B11,Inhaltsverzeichnis!$A$2:$C$1016,3,1))","v":"_"},{"$f":"IF(B11=\"\",\"_\",VLOOKUP(B11,Inhaltsverzeichnis!$A$2:$C$1016,2,1))","v":"_"},null,null,"Ruf v.d. Ev.:","","_","_"]
["Predigt:",null,{"$f":"IF(B12=\"\",\"_\",VLOOKUP(B12,Inhaltsverzeichnis!$A$2:$C$1016,3,1))","v":"_"},{"$f":"IF(B12=\"\",\"_\",VLOOKUP(B12,Inhaltsverzeichnis!$A$2:$C$1016,2,1))","v":"_"},null,null,"Predigt:","","_","_"]
[null,null,{"$f":"IF(B13=\"\",\"_\",VLOOKUP(B13,Inhaltsverzeichnis!$A$2:$C$1016,3,1))","v":"_"},{"$f":"IF(B13=\"\",\"_\",VLOOKUP(B13,Inhaltsverzeichnis!$A$2:$C$1016,2,1))","v":"_"},null,null,"","","_","_"]
["Credo:",null,{"$f":"IF(B14=\"\",\"_\",VLOOKUP(B14,Inhaltsverzeichnis!$A$2:$C$1016,3,1))","v":"_"},{"$f":"IF(B14=\"\",\"_\",VLOOKUP(B14,Inhaltsverzeichnis!$A$2:$C$1016,2,1))","v":"_"},null,null,"Credo:","","_","_"]
["Fürbitten:",null,{"$f":"IF(B15=\"\",\"_\",VLOOKUP(B15,Inhaltsverzeichnis!$A$2:$C$1016,3,1))","v":"_"},{"$f":"IF(B15=\"\",\"_\",VLOOKUP(B15,Inhaltsverzeichnis!$A$2:$C$1016,2,1))","v":"_"},null,null,"Fürbitten:","","_","_"]
["Gabenber.:",null,{"$f":"IF(B16=\"\",\"_\",VLOOKUP(B16,Inhaltsverzeichnis!$A$2:$C$1016,3,1))","v":"_"},{"$f":"IF(B16=\"\",\"_\",VLOOKUP(B16,Inhaltsverzeichnis!$A$2:$C$1016,2,1))","v":"_"},null,null,"Gabenber.:","","_","_"]
["Sanctus:",null,{"$f":"IF(B17=\"\",\"_\",VLOOKUP(B17,Inhaltsverzeichnis!$A$2:$C$1016,3,1))","v":"_"},{"$f":"IF(B17=\"\",\"_\",VLOOKUP(B17,Inhaltsverzeichnis!$A$2:$C$1016,2,1))","v":"_"},null,null,"Sanctus:","","_","_"]
["Vater unser:",null,{"$f":"IF(B18=\"\",\"_\",VLOOKUP(B18,Inhaltsverzeichnis!$A$2:$C$1016,3,1))","v":"_"},{"$f":"IF(B18=\"\",\"_\",VLOOKUP(B18,Inhaltsverzeichnis!$A$2:$C$1016,2,1))","v":"_"},null,null,"Vater unser:","","_","_"]
["Agnus Dei:",null,{"$f":"IF(B19=\"\",\"_\",VLOOKUP(B19,Inhaltsverzeichnis!$A$2:$C$1016,3,1))","v":"_"},{"$f":"IF(B19=\"\",\"_\",VLOOKUP(B19,Inhaltsverzeichnis!$A$2:$C$1016,2,1))","v":"_"},null,null,"Agnus Dei:","","_","_"]
["Kommunion:",null,{"$f":"IF(B20=\"\",\"_\",VLOOKUP(B20,Inhaltsverzeichnis!$A$2:$C$1016,3,1))","v":"_"},{"$f":"IF(B20=\"\",\"_\",VLOOKUP(B20,Inhaltsverzeichnis!$A$2:$C$1016,2,1))","v":"_"},null,null,"Kommunion:","","_","_"]
[null,null,{"$f":"IF(B21=\"\",\"_\",VLOOKUP(B21,Inhaltsverzeichnis!$A$2:$C$1016,3,1))","v":"_"},{"$f":"IF(B21=\"\",\"_\",VLOOKUP(B21,Inhaltsverzeichnis!$A$2:$C$1016,2,1))","v":"_"},null,null,"","","_","_"]
["Dank:",null,{"$f":"IF(B22=\"\",\"_\",VLOOKUP(B22,Inhaltsverzeichnis!$A$2:$C$1016,3,1))","v":"_"},{"$f":"IF(B22=\"\",\"_\",VLOOKUP(B22,Inhaltsverzeichnis!$A$2:$C$1016,2,1))","v":"_"},null,null,"Dank:","","_","_"]
["Schluss:",null,{"$f":"IF(B23=\"\",\"_\",VLOOKUP(B23,Inhaltsverzeichnis!$A$2:$C$1016,3,1))","v":"_"},{"$f":"IF(B23=\"\",\"_\",VLOOKUP(B23,Inhaltsverzeichnis!$A$2:$C$1016,2,1))","v":"_"},null,null,"Schluss:","","_","_"]
[null,null,{"$f":"IF(B24=\"\",\"_\",VLOOKUP(B24,Inhaltsverzeichnis!$A$2:$C$1016,3,1))","v":"_"},{"$f":"IF(B24=\"\",\"_\",VLOOKUP(B24,Inhaltsverzeichnis!$A$2:$C$1016,2,1))","v":"_"},null,null,"","","_","_"]

{"sheet":"Ausdruck 4xA6","index":1,"n_rows":50,"n_cols":10,"rows_kept":50,"merged":[[0,1,0,2],[0,4,23,4],[0,5,23,5],[0,7,0,8],[26,1,26,2],[26,4,49,4],[26,5,49,5],[26,7,26,8]]}
[{"$f":"IF('Ausdruck 2xA5'!A1=\"\",\"\",'Ausdruck 2xA5'!A1)","v":"Lieder für:"},{"$f":"IF('Ausdruck 2xA5'!B1=\"\",\"\",'Ausdruck 2xA5'!B1)","v":"2015-11-15"},null,{"$f":"IF('Ausdruck 2xA5'!D1=\"\",\"\",'Ausdruck 2xA5'!D1)","v":""},null,null,{"$f":"IF('Ausdruck 2xA5'!A1=\"\",\"\",'Ausdruck 2xA5'!A1)","v":"Lieder für:"},{"$f":"IF('Ausdruck 2xA5'!B1=\"\",\"\",'Ausdruck 2xA5'!B1)","v":"2015-11-15"},{"$f":"C1","v":"00:00:00"},{"$f":"IF('Ausdruck 2xA5'!D1=\"\",\"\",'Ausdruck 2xA5'!D1)","v":""}]
[{"$f":"IF('Ausdruck 2xA5'!A2=\"\",\"\",'Ausdruck 2xA5'!A2)","v":""},{"$f":"IF('Ausdruck 2xA5'!B2=\"\",\"\",'Ausdruck 2xA5'!B2)","v":"Nr."},{"$f":"IF('Ausdruck 2xA5'!C2=\"\",\"\",'Ausdruck 2xA5'!C2)","v":"Str."},{"$f":"IF('Ausdruck 2xA5'!D2=\"\",\"\",'Ausdruck 2xA5'!D2)","v":""},null,null,{"$f":"IF('Ausdruck 2xA5'!A2=\"\",\"\",'Ausdruck 2xA5'!A2)","v":""},{"$f":"IF('Ausdruck 2xA5'!B2=\"\",\"\",'Ausdruck 2xA5'!B2)","v":"Nr."},{"$f":"IF('Ausdruck 2xA5'!C2=\"\",\"\",'Ausdruck 2xA5'!C2)","v":"Str."},{"$f":"IF('Ausdruck 2xA5'!D2=\"\",\"\",'Ausdruck 2xA5'!D2)","v":""}]
[{"$f":"IF('Ausdruck 2xA5'!A3=\"\",\"\",'Ausdruck 2xA5'!A3)","v":"Eingang:"},{"$f":"IF('Ausdruck 2xA5'!B3=\"\",\"\",'Ausdruck 2xA5'!B3)","v":""},{"$f":"IF('Ausdruck 2xA5'!C3=\"\",\"\",'Ausdruck 2xA5'!C3)","v":"_"},{"$f":"IF('Ausdruck 2xA5'!D3=\"\",\"\",'Ausdruck 2xA5'!D3)","v":"_"},null,null,{"$f":"IF('Ausdruck 2xA5'!A3=\"\",\"\",'Ausdruck 2xA5'!A3)","v":"Eingang:"},{"$f":"IF('Ausdruck 2xA5'!B3=\"\",\"\",'Ausdruck 2xA5'!B3)","v":""},{"$f":"IF('Ausdruck 2xA5'!C3=\"\",\"\",'Ausdruck 2xA5'!C3)","v":"_"},{"$f":"IF('Ausdruck 2xA5'!D3=\"\",\"\",'Ausdruck 2xA5'!D3)","v":"_"}]
[{"$f":"IF('Ausdruck 2xA5'!A4=\"\",\"\",'Ausdruck 2xA5'!A4)","v":""},{"$f":"IF('Ausdruck 2xA5'!B4=\"\",\"\",'Ausdruck 2xA5'!B4)","v":""},{"$f":"IF('Ausdruck 2xA5'!C4=\"\",\"\",'Ausdruck 2xA5'!C4)","v":"_"},{"$f":"IF('Ausdruck 2xA5'!D4=\"\",\"\",'Ausdruck 2xA5'!D4)","v":"_"},null,null,{"$f":"IF('Ausdruck 2xA5'!A4=\"\",\"\",'Ausdruck 2xA5'!A4)","v":""},{"$f":"IF('Ausdruck 2xA5'!B4=\"\",\"\",'Ausdruck 2xA5'!B4)","v":""},{"$f":"IF('Ausdruck 2xA5'!C4=\"\",\"\",'Ausdruck 2xA5'!C4)","v":"_"},{"$f":"IF('Ausdruck 2xA5'!D4=\"\",\"\",'Ausdruck 2xA5'!D4)","v":"_"}]
[{"$f":"IF('Ausdruck 2xA5'!A5=\"\",\"\",'Ausdruck 2xA5'!A5)","v":"Kyrie:"},{"$f":"IF('Ausdruck 2xA5'!B5=\"\",\"\",'Ausdruck 2xA5'!B5)","v":""},{"$f":"IF('Ausdruck 2xA5'!C5=\"\",\"\",'Ausdruck 2xA5'!C5)","v":"_"},{"$f":"IF('Ausdruck 2xA5'!D5=\"\",\"\",'Ausdruck 2xA5'!D5)","v":"_"},null,null,{"$f":"IF('Ausdruck 2xA5'!A5=\"\",\"\",'Ausdruck 2xA5'!A5)","v":"Kyrie:"},{"$f":"IF('Ausdruck 2xA5'!B5=\"\",\"\",'Ausdruck 2xA5'!B5)","v":""},{"$f":"IF('Ausdruck 2xA5'!C5=\"\",\"\",'Ausdruck 2xA5'!C5)","v":"_"},{"$f":"IF('Ausdruck 2xA5'!D5=\"\",\"\",'Ausdruck 2xA5'!D5)","v":"_"}]
[{"$f":"IF('Ausdruck 2xA5'!A6=\"\",\"\",'Ausdruck 2xA5'!A6)","v":"Gloria:"},{"$f":"IF('Ausdruck 2xA5'!B6=\"\",\"\",'Ausdruck 2xA5'!B6)","v":""},{"$f":"IF('Ausdruck 2xA5'!C6=\"\",\"\",'Ausdruck 2xA5'!C6)","v":"_"},{"$f":"IF('Ausdruck 2xA5'!D6=\"\",\"\",'Ausdruck 2xA5'!D6)","v":"_"},null,null,{"$f":"IF('Ausdruck 2xA5'!A6=\"\",\"\",'Ausdruck 2xA5'!A6)","v":"Gloria:"},{"$f":"IF('Ausdruck 2xA5'!B6=\"\",\"\",'Ausdruck 2xA5'!B6)","v":""},{"$f":"IF('Ausdruck 2xA5'!C6=\"\",\"\",'Ausdruck 2xA5'!C6)","v":"_"},{"$f":"IF('Ausdruck 2xA5'!D6=\"\",\"\",'Ausdruck 2xA5'!D6)","v":"_"}]
[{"$f":"IF('Ausdruck 2xA5'!A7=\"\",\"\",'Ausdruck 2xA5'!A7)","v":"Tagesgebet:"},{"$f":"IF('Ausdruck 2xA5'!B7=\"\",\"\",'Ausdruck 2xA5'!B7)","v":""},{"$f":"IF('Ausdruck 2xA5'!C7=\"\",\"\",'Ausdruck 2xA5'!C7)","v":"_"},{"$f":"IF('Ausdruck 2xA5'!D7=\"\",\"\",'Ausdruck 2xA5'!D7)","v":"_"},null,null,{"$f":"IF('Ausdruck 2xA5'!A7=\"\",\"\",'Ausdruck 2xA5'!A7)","v":"Tagesgebet:"},{"$f":"IF('Ausdruck 2xA5'!B7=\"\",\"\",'Ausdruck 2xA5'!B7)","v":""},{"$f":"IF('Ausdruck 2xA5'!C7=\"\",\"\",'Ausdruck 2xA5'!C7)","v":"_"},{"$f":"IF('Ausdruck 2xA5'!D7=\"\",\"\",'Ausdruck 2xA5'!D7)","v":"_"}]
[{"$f":"IF('Ausdruck 2xA5'!A8=\"\",\"\",'Ausdruck 2xA5'!A8)","v":"Lesung 1:"},{"$f":"IF('Ausdruck 2xA5'!B8=\"\",\"\",'Ausdruck 2xA5'!B8)","v":""},{"$f":"IF('Ausdruck 2xA5'!C8=\"\",\"\",'Ausdruck 2xA5'!C8)","v":"_"},{"$f":"IF('Ausdruck 2xA5'!D8=\"\",\"\",'Ausdruck 2xA5'!D8)","v":"_"},null,null,{"$f":"IF('Ausdruck 2xA5'!A8=\"\",\"\",'Ausdruck 2xA5'!A8)","v":"Lesung 1:"},{"$f":"IF('Ausdruck 2xA5'!B8=\"\",\"\",'Ausdruck 2xA5'!B8)","v":""},{"$f":"IF('Ausdruck 2xA5'!C8=\"\",\"\",'Ausdruck 2xA5'!C8)","v":"_"},{"$f":"IF('Ausdruck 2xA5'!D8=\"\",\"\",'Ausdruck 2xA5'!D8)","v":"_"}]
[{"$f":"IF('Ausdruck 2xA5'!A9=\"\",\"\",'Ausdruck 2xA5'!A9)","v":"Zwischeng.:"},{"$f":"IF('Ausdruck 2xA5'!B9=\"\",\"\",'Ausdruck 2xA5'!B9)","v":""},{"$f":"IF('Ausdruck 2xA5'!C9=\"\",\"\",'Ausdruck 2xA5'!C9)","v":"_"},{"$f":"IF('Ausdruck 2xA5'!D9=\"\",\"\",'Ausdruck 2xA5'!D9)","v":"_"},null,null,{"$f":"IF('Ausdruck 2xA5'!A9=\"\",\"\",'Ausdruck 2xA5'!A9)","v":"Zwischeng.:"},{"$f":"IF('Ausdruck 2xA5'!B9=\"\",\"\",'Ausdruck 2xA5'!B9)","v":""},{"$f":"IF('Ausdruck 2xA5'!C9=\"\",\"\",'Ausdruck 2xA5'!C9)","v":"_"},{"$f":"IF('Ausdruck 2xA5'!D9=\"\",\"\",'Ausdruck 2xA5'!D9)","v":"_"}]
[{"$f":"IF('Ausdruck 2xA5'!A10=\"\",\"\",'Ausdruck 2xA5'!A10)","v":"Lesung 2:"},{"$f":"IF('Ausdruck 2xA5'!B10=\"\",\"\",'Ausdruck 2xA5'!B10)","v":""},{"$f":"IF('Ausdruck 2xA5'!C10=\"\",\"\",'Ausdruck 2xA5'!C10)","v":"_"},{"$f":"IF('Ausdruck 2xA5'!D10=\"\",\"\",'Ausdruck 2xA5'!D10)","v":"_"},null,null,{"$f":"IF('Ausdruck 2xA5'!A10=\"\",\"\",'Ausdruck 2xA5'!A10)","v":"Lesung 2:"},{"$f":"IF('Ausdruck 2xA5'!B10=\"\",\"\",'Ausdruck 2xA5'!B10)","v":""},{"$f":"IF('Ausdruck 2xA5'!C10=\"\",\"\",'Ausdruck 2xA5'!C10)","v":"_"},{"$f":"IF('Ausdruck 2xA5'!D10=\"\",\"\",'Ausdruck 2xA5'!D10)","v":"_"}]
[{"$f":"IF('Ausdruck 2xA5'!A11=\"\",\"\",'Ausdruck 2xA5'!A11)","v":"Ruf v.d. Ev.:"},{"$f":"IF('Ausdruck 2xA5'!B11=\"\",\"\",'Ausdruck 2xA5'!B11)","v":""},{"$f":"IF('Ausdruck 2xA5'!C11=\"\",\"\",'Ausdruck 2xA5'!C11)","v":"_"},{"$f":"IF('Ausdruck 2xA5'!D11=\"\",\"\",'Ausdruck 2xA5'!D11)","v":"_"},null,null,{"$f":"IF('Ausdruck 2xA5'!A11=\"\",\"\",'Ausdruck 2xA5'!A11)","v":"Ruf v.d. Ev.:"},{"$f":"IF('Ausdruck 2xA5'!B11=\"\",\"\",'Ausdruck 2xA5'!B11)","v":""},{"$f":"IF('Ausdruck 2xA5'!C11=\"\",\"\",'Ausdruck 2xA5'!C11)","v":"_"},{"$f":"IF('Ausdruck 2xA5'!D11=\"\",\"\",'Ausdruck 2xA5'!D11)","v":"_"}]
[{"$f":"IF('Ausdruck 2xA5'!A12=\"\",\"\",'Ausdruck 2xA5'!A12)","v":"Predigt:"},{"$f":"IF('Ausdruck 2xA5'!B12=\"\",\"\",'Ausdruck 2xA5'!B12)","v":""},{"$f":"IF('Ausdruck 2xA5'!C12=\"\",\"\",'Ausdruck 2xA5'!C12)","v":"_"},{"$f":"IF('Ausdruck 2xA5'!D12=\"\",\"\",'Ausdruck 2xA5'!D12)","v":"_"},null,null,{"$f":"IF('Ausdruck 2xA5'!A12=\"\",\"\",'Ausdruck 2xA5'!A12)","v":"Predigt:"},{"$f":"IF('Ausdruck 2xA5'!B12=\"\",\"\",'Ausdruck 2xA5'!B12)","v":""},{"$f":"IF('Ausdruck 2xA5'!C12=\"\",\"\",'Ausdruck 2xA5'!C12)","v":"_"},{"$f":"IF('Ausdruck 2xA5'!D12=\"\",\"\",'Ausdruck 2xA5'!D12)","v":"_"}]
[{"$f":"IF('Ausdruck 2xA5'!A13=\"\",\"\",'Ausdruck 2xA5'!A13)","v":""},{"$f":"IF('Ausdruck 2xA5'!B13=\"\",\"\",'Ausdruck 2xA5'!B13)","v":""},{"$f":"IF('Ausdruck 2xA5'!C13=\"\",\"\",'Ausdruck 2xA5'!C13)","v":"_"},{"$f":"IF('Ausdruck 2xA5'!D13=\"\",\"\",'Ausdruck 2xA5'!D13)","v":"_"},null,null,{"$f":"IF('Ausdruck 2xA5'!A13=\"\",\"\",'Ausdruck 2xA5'!A13)","v":""},{"$f":"IF('Ausdruck 2xA5'!B13=\"\",\"\",'Ausdruck 2xA5'!B13)","v":""},{"$f":"IF('Ausdruck 2xA5'!C13=\"\",\"\",'Ausdruck 2xA5'!C13)","v":"_"},{"$f":"IF('Ausdruck 2xA5'!D13=\"\",\"\",'Ausdruck 2xA5'!D13)","v":"_"}]
[{"$f":"IF('Ausdruck 2xA5'!A14=\"\",\"\",'Ausdruck 2xA5'!A14)","v":"Credo:"},{"$f":"IF('Ausdruck 2xA5'!B14=\"\",\"\",'Ausdruck 2xA5'!B14)","v":""},{"$f":"IF('Ausdruck 2xA5'!C14=\"\",\"\",'Ausdruck 2xA5'!C14)","v":"_"},{"$f":"IF('Ausdruck 2xA5'!D14=\"\",\"\",'Ausdruck 2xA5'!D14)","v":"_"},null,null,{"$f":"IF('Ausdruck 2xA5'!A14=\"\",\"\",'Ausdruck 2xA5'!A14)","v":"Credo:"},{"$f":"IF('Ausdruck 2xA5'!B14=\"\",\"\",'Ausdruck 2xA5'!B14)","v":""},{"$f":"IF('Ausdruck 2xA5'!C14=\"\",\"\",'Ausdruck 2xA5'!C14)","v":"_"},{"$f":"IF('Ausdruck 2xA5'!D14=\"\",\"\",'Ausdruck 2xA5'!D14)","v":"_"}]
[{"$f":"IF('Ausdruck 2xA5'!A15=\"\",\"\",'Ausdruck 2xA5'!A15)","v":"Fürbitten:"},{"$f":"IF('Ausdruck 2xA5'!B15=\"\",\"\",'Ausdruck 2xA5'!B15)","v":""},{"$f":"IF('Ausdruck 2xA5'!C15=\"\",\"\",'Ausdruck 2xA5'!C15)","v":"_"},{"$f":"IF('Ausdruck 2xA5'!D15=\"\",\"\",'Ausdruck 2xA5'!D15)","v":"_"},null,null,{"$f":"IF('Ausdruck 2xA5'!A15=\"\",\"\",'Ausdruck 2xA5'!A15)","v":"Fürbitten:"},{"$f":"IF('Ausdruck 2xA5'!B15=\"\",\"\",'Ausdruck 2xA5'!B15)","v":""},{"$f":"IF('Ausdruck 2xA5'!C15=\"\",\"\",'Ausdruck 2xA5'!C15)","v":"_"},{"$f":"IF('Ausdruck 2xA5'!D15=\"\",\"\",'Ausdruck 2xA5'!D15)","v":"_"}]
[{"$f":"IF('Ausdruck 2xA5'!A16=\"\",\"\",'Ausdruck 2xA5'!A16)","v":"Gabenber.:"},{"$f":"IF('Ausdruck 2xA5'!B16=\"\",\"\",'Ausdruck 2xA5'!B16)","v":""},{"$f":"IF('Ausdruck 2xA5'!C16=\"\",\"\",'Ausdruck 2xA5'!C16)","v":"_"},{"$f":"IF('Ausdruck 2xA5'!D16=\"\",\"\",'Ausdruck 2xA5'!D16)","v":"_"},null,null,{"$f":"IF('Ausdruck 2xA5'!A16=\"\",\"\",'Ausdruck 2xA5'!A16)","v":"Gabenber.:"},{"$f":"IF('Ausdruck 2xA5'!B16=\"\",\"\",'Ausdruck 2xA5'!B16)","v":""},{"$f":"IF('Ausdruck 2xA5'!C16=\"\",\"\",'Ausdruck 2xA5'!C16)","v":"_"},{"$f":"IF('Ausdruck 2xA5'!D16=\"\",\"\",'Ausdruck 2xA5'!D16)","v":"_"}]
[{"$f":"IF('Ausdruck 2xA5'!A17=\"\",\"\",'Ausdruck 2xA5'!A17)","v":"Sanctus:"},{"$f":"IF('Ausdruck 2xA5'!B17=\"\",\"\",'Ausdruck 2xA5'!B17)","v":""},{"$f":"IF('Ausdruck 2xA5'!C17=\"\",\"\",'Ausdruck 2xA5'!C17)","v":"_"},{"$f":"IF('Ausdruck 2xA5'!D17=\"\",\"\",'Ausdruck 2xA5'!D17)","v":"_"},null,null,{"$f":"IF('Ausdruck 2xA5'!A17=\"\",\"\",'Ausdruck 2xA5'!A17)","v":"Sanctus:"},{"$f":"IF('Ausdruck 2xA5'!B17=\"\",\"\",'Ausdruck 2xA5'!B17)","v":""},{"$f":"IF('Ausdruck 2xA5'!C17=\"\",\"\",'Ausdruck 2xA5'!C17)","v":"_"},{"$f":"IF('Ausdruck 2xA5'!D17=\"\",\"\",'Ausdruck 2xA5'!D17)","v":"_"}]
[{"$f":"IF('Ausdruck 2xA5'!A18=\"\",\"\",'Ausdruck 2xA5'!A18)","v":"Vater unser:"},{"$f":"IF('Ausdruck 2xA5'!B18=\"\",\"\",'Ausdruck 2xA5'!B18)","v":""},{"$f":"IF('Ausdruck 2xA5'!C18=\"\",\"\",'Ausdruck 2xA5'!C18)","v":"_"},{"$f":"IF('Ausdruck 2xA5'!D18=\"\",\"\",'Ausdruck 2xA5'!D18)","v":"_"},null,null,{"$f":"IF('Ausdruck 2xA5'!A18=\"\",\"\",'Ausdruck 2xA5'!A18)","v":"Vater unser:"},{"$f":"IF('Ausdruck 2xA5'!B18=\"\",\"\",'Ausdruck 2xA5'!B18)","v":""},{"$f":"IF('Ausdruck 2xA5'!C18=\"\",\"\",'Ausdruck 2xA5'!C18)","v":"_"},{"$f":"IF('Ausdruck 2xA5'!D18=\"\",\"\",'Ausdruck 2xA5'!D18)","v":"_"}]
[{"$f":"IF('Ausdruck 2xA5'!A19=\"\",\"\",'Ausdruck 2xA5'!A19)","v":"Agnus Dei:"},{"$f":"IF('Ausdruck 2xA5'!B19=\"\",\"\",'Ausdruck 2xA5'!B19)","v":""},{"$f":"IF('Ausdruck 2xA5'!C19=\"\",\"\",'Ausdruck 2xA5'!C19)","v":"_"},{"$f":"IF('Ausdruck 2xA5'!D19=\"\",\"\",'Ausdruck 2xA5'!D19)","v":"_"},null,null,{"$f":"IF('Ausdruck 2xA5'!A19=\"\",\"\",'Ausdruck 2xA5'!A19)","v":"Agnus Dei:"},{"$f":"IF('Ausdruck 2xA5'!B19=\"\",\"\",'Ausdruck 2xA5'!B19)","v":""},{"$f":"IF('Ausdruck 2xA5'!C19=\"\",\"\",'Ausdruck 2xA5'!C19)","v":"_"},{"$f":"IF('Ausdruck 2xA5'!D19=\"\",\"\",'Ausdruck 2xA5'!D19)","v":"_"}]
[{"$f":"IF('Ausdruck 2xA5'!A20=\"\",\"\",'Ausdruck 2xA5'!A20)","v":"Kommunion:"},{"$f":"IF('Ausdruck 2xA5'!B20=\"\",\"\",'Ausdruck 2xA5'!B20)","v":""},{"$f":"IF('Ausdruck 2xA5'!C20=\"\",\"\",'Ausdruck 2xA5'!C20)","v":"_"},{"$f":"IF('Ausdruck 2xA5'!D20=\"\",\"\",'Ausdruck 2xA5'!D20)","v":"_"},null,null,{"$f":"IF('Ausdruck 2xA5'!A20=\"\",\"\",'Ausdruck 2xA5'!A20)","v":"Kommunion:"},{"$f":"IF('Ausdruck 2xA5'!B20=\"\",\"\",'Ausdruck 2xA5'!B20)","v":""},{"$f":"IF('Ausdruck 2xA5'!C20=\"\",\"\",'Ausdruck 2xA5'!C20)","v":"_"},{"$f":"IF('Ausdruck 2xA5'!D20=\"\",\"\",'Ausdruck 2xA5'!D20)","v":"_"}]
[{"$f":"IF('Ausdruck 2xA5'!A21=\"\",\"\",'Ausdruck 2xA5'!A21)","v":""},{"$f":"IF('Ausdruck 2xA5'!B21=\"\",\"\",'Ausdruck 2xA5'!B21)","v":""},{"$f":"IF('Ausdruck 2xA5'!C21=\"\",\"\",'Ausdruck 2xA5'!C21)","v":"_"},{"$f":"IF('Ausdruck 2xA5'!D21=\"\",\"\",'Ausdruck 2xA5'!D21)","v":"_"},null,null,{"$f":"IF('Ausdruck 2xA5'!A21=\"\",\"\",'Ausdruck 2xA5'!A21)","v":""},{"$f":"IF('Ausdruck 2xA5'!B21=\"\",\"\",'Ausdruck 2xA5'!B21)","v":""},{"$f":"IF('Ausdruck 2xA5'!C21=\"\",\"\",'Ausdruck 2xA5'!C21)","v":"_"},{"$f":"IF('Ausdruck 2xA5'!D21=\"\",\"\",'Ausdruck 2xA5'!D21)","v":"_"}]
[{"$f":"IF('Ausdruck 2xA5'!A22=\"\",\"\",'Ausdruck 2xA5'!A22)","v":"Dank:"},{"$f":"IF('Ausdruck 2xA5'!B22=\"\",\"\",'Ausdruck 2xA5'!B22)","v":""},{"$f":"IF('Ausdruck 2xA5'!C22=\"\",\"\",'Ausdruck 2xA5'!C22)","v":"_"},{"$f":"IF('Ausdruck 2xA5'!D22=\"\",\"\",'Ausdruck 2xA5'!D22)","v":"_"},null,null,{"$f":"IF('Ausdruck 2xA5'!A22=\"\",\"\",'Ausdruck 2xA5'!A22)","v":"Dank:"},{"$f":"IF('Ausdruck 2xA5'!B22=\"\",\"\",'Ausdruck 2xA5'!B22)","v":""},{"$f":"IF('Ausdruck 2xA5'!C22=\"\",\"\",'Ausdruck 2xA5'!C22)","v":"_"},{"$f":"IF('Ausdruck 2xA5'!D22=\"\",\"\",'Ausdruck 2xA5'!D22)","v":"_"}]
[{"$f":"IF('Ausdruck 2xA5'!A23=\"\",\"\",'Ausdruck 2xA5'!A23)","v":"Schluss:"},{"$f":"IF('Ausdruck 2xA5'!B23=\"\",\"\",'Ausdruck 2xA5'!B23)","v":""},{"$f":"IF('Ausdruck 2xA5'!C23=\"\",\"\",'Ausdruck 2xA5'!C23)","v":"_"},{"$f":"IF('Ausdruck 2xA5'!D23=\"\",\"\",'Ausdruck 2xA5'!D23)","v":"_"},null,null,{"$f":"IF('Ausdruck 2xA5'!A23=\"\",\"\",'Ausdruck 2xA5'!A23)","v":"Schluss:"},{"$f":"IF('Ausdruck 2xA5'!B23=\"\",\"\",'Ausdruck 2xA5'!B23)","v":""},{"$f":"IF('Ausdruck 2xA5'!C23=\"\",\"\",'Ausdruck 2xA5'!C23)","v":"_"},{"$f":"IF('Ausdruck 2xA5'!D23=\"\",\"\",'Ausdruck 2xA5'!D23)","v":"_"}]
[{"$f":"IF('Ausdruck 2xA5'!A24=\"\",\"\",'Ausdruck 2xA5'!A24)","v":""},{"$f":"IF('Ausdruck 2xA5'!B24=\"\",\"\",'Ausdruck 2xA5'!B24)","v":""},{"$f":"IF('Ausdruck 2xA5'!C24=\"\",\"\",'Ausdruck 2xA5'!C24)","v":"_"},{"$f":"IF('Ausdruck 2xA5'!D24=\"\",\"\",'Ausdruck 2xA5'!D24)","v":"_"},null,null,{"$f":"IF('Ausdruck 2xA5'!A24=\"\",\"\",'Ausdruck 2xA5'!A24)","v":""},{"$f":"IF('Ausdruck 2xA5'!B24=\"\",\"\",'Ausdruck 2xA5'!B24)","v":""},{"$f":"IF('Ausdruck 2xA5'!C24=\"\",\"\",'Ausdruck 2xA5'!C24)","v":"_"},{"$f":"IF('Ausdruck 2xA5'!D24=\"\",\"\",'Ausdruck 2xA5'!D24)","v":"_"}]
[]
[]
[{"$f":"IF('Ausdruck 2xA5'!A1=\"\",\"\",'Ausdruck 2xA5'!A1)","v":"Lieder für:"},{"$f":"IF('Ausdruck 2xA5'!B1=\"\",\"\",'Ausdruck 2xA5'!B1)","v":"2015-11-15"},null,{"$f":"IF('Ausdruck 2xA5'!D1=\"\",\"\",'Ausdruck 2xA5'!D1)","v":""},null,null,{"$f":"IF('Ausdruck 2xA5'!A1=\"\",\"\",'Ausdruck 2xA5'!A1)","v":"Lieder für:"},{"$f":"IF('Ausdruck 2xA5'!B1=\"\",\"\",'Ausdruck 2xA5'!B1)","v":"2015-11-15"},{"$f":"C27","v":"00:00:00"},{"$f":"IF('Ausdruck 2xA5'!D1=\"\",\"\",'Ausdruck 2xA5'!D1)","v":""}]
[{"$f":"IF('Ausdruck 2xA5'!A2=\"\",\"\",'Ausdruck 2xA5'!A2)","v":""},{"$f":"IF('Ausdruck 2xA5'!B2=\"\",\"\",'Ausdruck 2xA5'!B2)","v":"Nr."},{"$f":"IF('Ausdruck 2xA5'!C2=\"\",\"\",'Ausdruck 2xA5'!C2)","v":"Str."},{"$f":"IF('Ausdruck 2xA5'!D2=\"\",\"\",'Ausdruck 2xA5'!D2)","v":""},null,null,{"$f":"IF('Ausdruck 2xA5'!A2=\"\",\"\",'Ausdruck 2xA5'!A2)","v":""},{"$f":"IF('Ausdruck 2xA5'!B2=\"\",\"\",'Ausdruck 2xA5'!B2)","v":"Nr."},{"$f":"IF('Ausdruck 2xA5'!C2=\"\",\"\",'Ausdruck 2xA5'!C2)","v":"Str."},{"$f":"IF('Ausdruck 2xA5'!D2=\"\",\"\",'Ausdruck 2xA5'!D2)","v":""}]
[{"$f":"IF('Ausdruck 2xA5'!A3=\"\",\"\",'Ausdruck 2xA5'!A3)","v":"Eingang:"},{"$f":"IF('Ausdruck 2xA5'!B3=\"\",\"\",'Ausdruck 2xA5'!B3)","v":""},{"$f":"IF('Ausdruck 2xA5'!C3=\"\",\"\",'Ausdruck 2xA5'!C3)","v":"_"},{"$f":"IF('Ausdruck 2xA5'!D3=\"\",\"\",'Ausdruck 2xA5'!D3)","v":"_"},null,null,{"$f":"IF('Ausdruck 2xA5'!A3=\"\",\"\",'Ausdruck 2xA5'!A3)","v":"Eingang:"},{"$f":"IF('Ausdruck 2xA5'!B3=\"\",\"\",'Ausdruck 2xA5'!B3)","v":""},{"$f":"IF('Ausdruck 2xA5'!C3=\"\",\"\",'Ausdruck 2xA5'!C3)","v":"_"},{"$f":"IF('Ausdruck 2xA5'!D3=\"\",\"\",'Ausdruck 2xA5'!D3)","v":"_"}]
[{"$f":"IF('Ausdruck 2xA5'!A4=\"\",\"\",'Ausdruck 2xA5'!A4)","v":""},{"$f":"IF('Ausdruck 2xA5'!B4=\"\",\"\",'Ausdruck 2xA5'!B4)","v":""},{"$f":"IF('Ausdruck 2xA5'!C4=\"\",\"\",'Ausdruck 2xA5'!C4)","v":"_"},{"$f":"IF('Ausdruck 2xA5'!D4=\"\",\"\",'Ausdruck 2xA5'!D4)","v":"_"},null,null,{"$f":"IF('Ausdruck 2xA5'!A4=\"\",\"\",'Ausdruck 2xA5'!A4)","v":""},{"$f":"IF('Ausdruck 2xA5'!B4=\"\",\"\",'Ausdruck 2xA5'!B4)","v":""},{"$f":"IF('Ausdruck 2xA5'!C4=\"\",\"\",'Ausdruck 2xA5'!C4)","v":"_"},{"$f":"IF('Ausdruck 2xA5'!D4=\"\",\"\",'Ausdruck 2xA5'!D4)","v":"_"}]
{"$rows_left_out":21}
{"sheet":"Inhaltsverzeichnis","index":2,"n_rows":0,"n_cols":0,"rows_kept":0}